Target
Cystic fibrosis transmembrane conductance regulator
Ligand
BDBM50032693
Substrate
Meas. Tech.
ChEMBL_2152470 (CHEMBL5037017)
EC50
68±n/a nM
Citation
 Grand, DLGosling, MBaettig, UBahra, PBala, KBrocklehurst, CBudd, EButler, RCheung, AKChoudhury, HCollingwood, SPCox, BDanahay, HEdwards, LEveratt, BGlaenzel, UGlotin, ALGroot-Kormelink, PHall, EHatto, JHowsham, CHughes, GKing, AKoehler, JKulkarni, SLightfoot, MNicholls, IPage, CPergl-Wilson, GPopa, MORobinson, RRowlands, DSharp, TSpendiff, MStanley, ESteward, OTaylor, RJTranter, PWagner, TWatson, HWilliams, GWright, PYoung, ASandham, DA Discovery of Icenticaftor (QBW251), a Cystic Fibrosis Transmembrane Conductance Regulator Potentiator with Clinical Efficacy in Cystic Fibrosis and Chronic Obstructive Pulmonary Disease. J Med Chem 64:7241-7260 (2021)  
Target
Name:
Cystic fibrosis transmembrane conductance regulator
Synonyms:
ABCC7 CFTR Channel conductance-controlling ATPase | cAMP-dependent chloride channel
Type:
Enzyme Catalytic Domain
Mol. Mass.:
168171.30
Organism:
Homo sapiens (Human)
Description:
gi_90421313
Residue:
1480
  
Inhibitor
Name:
BDBM50032693
Synonyms:
CHEBI:66901 Kalydeco | VX-770
Type:
Small organic molecule
Emp. Form.:
C24H28N2O3
Mol. Mass.:
392.4907
SMILES:
CC(C)(C)c1cc(c(NC(=O)c2c[nH]c3ccccc3c2=O)cc1O)C(C)(C)C
: