Target
Adenosine kinase
Ligand
BDBM50150300
Substrate
Meas. Tech.
ChEMBL_305608 (CHEMBL828146)
IC50
120±n/a nM
Citation
 Gomtsyan, ADidomenico, SLee, CHStewart, AOBhagwat, SSKowaluk, EAJarvis, MF Synthesis and biological evaluation of pteridine and pyrazolopyrimidine based adenosine kinase inhibitors. Bioorg Med Chem Lett 14:4165-8 (2004)  
Target
Name:
Adenosine kinase
Synonyms:
ADK | ADK_HUMAN
Type:
PROTEIN
Mol. Mass.:
40545.97
Organism:
Homo sapiens (Human)
Description:
ChEMBL_1467841
Residue:
362
  
Inhibitor
Name:
BDBM50150300
Synonyms:
CHEMBL359631 | [7-(6-Morpholin-4-yl-pyridin-3-yl)-pteridin-4-yl]-phenethyl-amine
Type:
Small organic molecule
Emp. Form.:
C23H23N7O
Mol. Mass.:
413.475
SMILES:
C(Cc1ccccc1)Nc1ncnc2nc(cnc12)-c1ccc(nc1)N1CCOCC1
: