Target
5-hydroxytryptamine receptor 7
Ligand
BDBM50150407
Substrate
Meas. Tech.
ChEMBL_302553 (CHEMBL828254)
Ki
2±n/a nM
Citation
 Mattson, RJDenhart, DJCatt, JDDee, MFDeskus, JADitta, JLEpperson, JDalton King, HGao, APoss, MAPurandare, ATortolani, DZhao, YYang, HYeola, SPalmer, JTorrente, JStark, AJohnson, G Aminotriazine 5-HT7 antagonists. Bioorg Med Chem Lett 14:4245-8 (2004)  
Target
Name:
5-hydroxytryptamine receptor 7
Synonyms:
5-HT-7 5-HT7 5-HT7S 5HT7 HTR7 | Serotonin receptor 7
Type:
G Protein-Coupled Receptor (GPCR)
Mol. Mass.:
53573.08
Organism:
Homo sapiens (Human)
Description:
P34969
Residue:
479
  
Inhibitor
Name:
BDBM50150407
Synonyms:
CHEMBL180086 | N-[1-(4-Fluoro-phenyl)-ethyl]-N''-(2-thiophen-2-yl-ethyl)-[1,3,5]triazine-2,4,6-triamine
Type:
Small organic molecule
Emp. Form.:
C17H19FN6S
Mol. Mass.:
358.436
SMILES:
CC(Nc1nc(N)nc(NCCc2cccs2)n1)c1ccc(F)cc1
: