Target
Peroxisome proliferator-activated receptor gamma
Ligand
BDBM50151001
Substrate
Meas. Tech.
ChEMBL_302951 (CHEMBL841786)
Ki
1±n/a nM
Citation
 Henke, BR Peroxisome proliferator-activated receptor alpha/gamma dual agonists for the treatment of type 2 diabetes. J Med Chem 47:4118-27 (2004)  
Target
Name:
Peroxisome proliferator-activated receptor gamma
Synonyms:
NR1C3 PPAR-gamma PPARG_HUMAN Peroxisome proliferator-activated receptor gamma (PPAR gamma) Peroxisome proliferator-activated receptor gamma (PPARĪ³) peroxisome proliferator-activated receptor gamma isoform 2
Type:
Nuclear Receptor
Mol. Mass.:
57613.46
Organism:
Homo sapiens (Human)
Description:
P37231
Residue:
505
  
Inhibitor
Name:
BDBM50151001
Synonyms:
(S)-2-((Z)-1-Methyl-3-oxo-3-phenyl-propenylamino)-3-{4-[2-(5-methyl-2-phenyl-oxazol-4-yl)-ethoxy]-phenyl}-propionic acid | CHEMBL410478
Type:
Small organic molecule
Emp. Form.:
C31H30N2O5
Mol. Mass.:
510.5803
SMILES:
CC(CC(=O)c1ccccc1)=N[C@@H](Cc1ccc(OCCc2nc(oc2C)-c2ccccc2)cc1)C(O)=O
: