Target
Poly [ADP-ribose] polymerase 1
Ligand
BDBM50151012
Substrate
Meas. Tech.
ChEMBL_306013 (CHEMBL833529)
IC50
12±n/a nM
Citation
 Hattori, KKido, YYamamoto, HIshida, JKamijo, KMurano, KOhkubo, MKinoshita, TIwashita, AMihara, KYamazaki, SMatsuoka, NTeramura, YMiyake, H Rational approaches to discovery of orally active and brain-penetrable quinazolinone inhibitors of poly(ADP-ribose)polymerase. J Med Chem 47:4151-4 (2004)  
Target
Name:
Poly [ADP-ribose] polymerase 1
Synonyms:
(ARTD1 or PARP1) 2.4.2.30 ADPRT ARTD1 Human diphtheria toxin-like ADP-ribosyltransferase (ARTD1 or PARP1) NT-PARP-1 PARP1 PPOL Poly [ADP-ribose] polymerase 1 (PARP) Poly [ADP-ribose] polymerase 1 (PARP1) Poly [ADP-ribose] polymerase 1, 28-kDa form Poly [ADP-ribose] polymerase 1, processed C-terminus Poly [ADP-ribose] polymerase-1 Poly(ADP-ribose) polymerase-1 (ARTD1/PARP1) Protein poly-ADP-ribosyltransferase PARP1 | Synonyms=ADPRT
Type:
Mol. Mass.:
113114.22
Organism:
Homo sapiens (Human)
Description:
P09874
Residue:
1014
  
Inhibitor
Name:
BDBM50151012
Synonyms:
2-{3-[4-(4-Hydroxy-phenyl)-3,6-dihydro-2H-pyridin-1-yl]-propyl}-3H-quinazolin-4-one | CHEMBL364364
Type:
Small organic molecule
Emp. Form.:
C22H23N3O2
Mol. Mass.:
361.4369
SMILES:
Oc1ccc(cc1)C1=CCN(CCCc2nc3ccccc3c(=O)[nH]2)CC1
: