Target
Poly [ADP-ribose] polymerase 1
Ligand
BDBM50151013
Substrate
Meas. Tech.
ChEMBL_306013 (CHEMBL833529)
IC50
12±n/a nM
Citation
 Hattori, KKido, YYamamoto, HIshida, JKamijo, KMurano, KOhkubo, MKinoshita, TIwashita, AMihara, KYamazaki, SMatsuoka, NTeramura, YMiyake, H Rational approaches to discovery of orally active and brain-penetrable quinazolinone inhibitors of poly(ADP-ribose)polymerase. J Med Chem 47:4151-4 (2004)  
Target
Name:
Poly [ADP-ribose] polymerase 1
Synonyms:
(ARTD1 or PARP1) 2.4.2.30 ADPRT ARTD1 Human diphtheria toxin-like ADP-ribosyltransferase (ARTD1 or PARP1) NT-PARP-1 PARP1 PPOL Poly [ADP-ribose] polymerase 1 (PARP) Poly [ADP-ribose] polymerase 1 (PARP1) Poly [ADP-ribose] polymerase 1, 28-kDa form Poly [ADP-ribose] polymerase 1, processed C-terminus Poly [ADP-ribose] polymerase-1 Poly(ADP-ribose) polymerase-1 (ARTD1/PARP1) Protein poly-ADP-ribosyltransferase PARP1 | Synonyms=ADPRT
Type:
Mol. Mass.:
113114.22
Organism:
Homo sapiens (Human)
Description:
P09874
Residue:
1014
  
Inhibitor
Name:
BDBM50151013
Synonyms:
2-{3-[4-(4-Pyridin-1-yl-phenyl)-3,6-dihydro-2H-pyridin-1-yl]-propyl}-3H-quinazolin-4-one | CHEMBL188985
Type:
Small organic molecule
Emp. Form.:
C27H27N4O
Mol. Mass.:
423.5289
SMILES:
O=c1[nH]c(CCCN2CCC(=CC2)c2ccc(cc2)-[n+]2ccccc2)nc2ccccc12
: