Target
Poly [ADP-ribose] polymerase 1
Ligand
BDBM50151025
Substrate
Meas. Tech.
ChEMBL_306013 (CHEMBL833529)
IC50
12±n/a nM
Citation
 Hattori, KKido, YYamamoto, HIshida, JKamijo, KMurano, KOhkubo, MKinoshita, TIwashita, AMihara, KYamazaki, SMatsuoka, NTeramura, YMiyake, H Rational approaches to discovery of orally active and brain-penetrable quinazolinone inhibitors of poly(ADP-ribose)polymerase. J Med Chem 47:4151-4 (2004)  
Target
Name:
Poly [ADP-ribose] polymerase 1
Synonyms:
(ARTD1 or PARP1) 2.4.2.30 ADPRT ARTD1 Human diphtheria toxin-like ADP-ribosyltransferase (ARTD1 or PARP1) NT-PARP-1 PARP1 PPOL Poly [ADP-ribose] polymerase 1 (PARP) Poly [ADP-ribose] polymerase 1 (PARP1) Poly [ADP-ribose] polymerase 1, 28-kDa form Poly [ADP-ribose] polymerase 1, processed C-terminus Poly [ADP-ribose] polymerase-1 Poly(ADP-ribose) polymerase-1 (ARTD1/PARP1) Protein poly-ADP-ribosyltransferase PARP1 | Synonyms=ADPRT
Type:
Mol. Mass.:
113114.22
Organism:
Homo sapiens (Human)
Description:
P09874
Residue:
1014
  
Inhibitor
Name:
BDBM50151025
Synonyms:
2-[3-(1,4,5,6-Tetrahydro-2H-benzo[f]isoquinolin-3-yl)-propyl]-3H-quinazolin-4-one | CHEMBL186380
Type:
Small organic molecule
Emp. Form.:
C24H25N3O
Mol. Mass.:
371.4748
SMILES:
O=c1[nH]c(CCCN2CCC3=C(CCc4ccccc34)C2)nc2ccccc12
: