Target
Poly [ADP-ribose] polymerase 1
Ligand
BDBM27706
Substrate
Meas. Tech.
ChEMBL_306013 (CHEMBL833529)
IC50
26±n/a nM
Citation
 Hattori, KKido, YYamamoto, HIshida, JKamijo, KMurano, KOhkubo, MKinoshita, TIwashita, AMihara, KYamazaki, SMatsuoka, NTeramura, YMiyake, H Rational approaches to discovery of orally active and brain-penetrable quinazolinone inhibitors of poly(ADP-ribose)polymerase. J Med Chem 47:4151-4 (2004)  
Target
Name:
Poly [ADP-ribose] polymerase 1
Synonyms:
(ARTD1 or PARP1) 2.4.2.30 ADPRT ARTD1 Human diphtheria toxin-like ADP-ribosyltransferase (ARTD1 or PARP1) NT-PARP-1 PARP1 PPOL Poly [ADP-ribose] polymerase 1 (PARP) Poly [ADP-ribose] polymerase 1 (PARP1) Poly [ADP-ribose] polymerase 1, 28-kDa form Poly [ADP-ribose] polymerase 1, processed C-terminus Poly [ADP-ribose] polymerase-1 Poly(ADP-ribose) polymerase-1 (ARTD1/PARP1) Protein poly-ADP-ribosyltransferase PARP1 | Synonyms=ADPRT
Type:
Mol. Mass.:
113114.22
Organism:
Homo sapiens (Human)
Description:
P09874
Residue:
1014
  
Inhibitor
Name:
BDBM27706
Synonyms:
8-chloro-2-[3-(4-phenyl-1,2,3,6-tetrahydropyridin-1-yl)propyl]-3,4-dihydroquinazolin-4-one quinazolinone analogue, 1b
Type:
Small organic molecule
Emp. Form.:
C22H22ClN3O
Mol. Mass.:
379.883
SMILES:
Clc1cccc2c1nc(CCCN1CCC(=CC1)c1ccccc1)[nH]c2=O
: