Target
5-hydroxytryptamine receptor 7
Ligand
BDBM50582610
Substrate
Meas. Tech.
ChEMBL_2155111 (CHEMBL5039771)
EC50
92±n/a nM
Citation
 Lee, JKwag, RLee, SKim, DWoo, JCho, YKim, HJKim, JJeon, BChoo, H Discovery of G Protein-Biased Ligands against 5-HT J Med Chem 64:7453-7467 (2021)  
Target
Name:
5-hydroxytryptamine receptor 7
Synonyms:
5-HT-7 5-HT7 5-HT7S 5HT7 HTR7 | Serotonin receptor 7
Type:
G Protein-Coupled Receptor (GPCR)
Mol. Mass.:
53573.08
Organism:
Homo sapiens (Human)
Description:
P34969
Residue:
479
  
Inhibitor
Name:
BDBM50582610
Synonyms:
CHEMBL5077293
Type:
Small organic molecule
Emp. Form.:
C17H18ClNO
Mol. Mass.:
287.784
SMILES:
COc1ccccc1-c1cc(ccc1Cl)C1CCNC1
: