Target
5-hydroxytryptamine receptor 7
Ligand
BDBM10755
Substrate
Meas. Tech.
ChEMBL_2155112 (CHEMBL5039772)
EC50
112±n/a nM
Citation
 Lee, JKwag, RLee, SKim, DWoo, JCho, YKim, HJKim, JJeon, BChoo, H Discovery of G Protein-Biased Ligands against 5-HT J Med Chem 64:7453-7467 (2021)  
Target
Name:
5-hydroxytryptamine receptor 7
Synonyms:
5-HT-7 5-HT7 5-HT7S 5HT7 HTR7 | Serotonin receptor 7
Type:
G Protein-Coupled Receptor (GPCR)
Mol. Mass.:
53573.08
Organism:
Homo sapiens (Human)
Description:
P34969
Residue:
479
  
Inhibitor
Name:
BDBM10755
Synonyms:
14C-5-hydroxy tryptamine creatinine disulfate 5-HT 5-hydroxy tryptamine creatinine disulfate Serotonin | [3H]-5-HT
Type:
Small organic molecule
Emp. Form.:
C10H12N2O
Mol. Mass.:
176.2151
SMILES:
NCCc1c[nH]c2ccc(O)cc12
: