Target
Cyclic GMP-AMP synthase
Ligand
BDBM50582694
Substrate
Meas. Tech.
ChEMBL_2155362 (CHEMBL5040022)
IC50
20100±n/a nM
Citation
 Tan, JWu, BChen, TFan, CZhao, JXiong, CFeng, CXiao, RDing, CTang, WZhang, A Synthesis and Pharmacological Evaluation of Tetrahydro-?-carboline Derivatives as Potent Anti-inflammatory Agents Targeting Cyclic GMP-AMP Synthase. J Med Chem 64:7667-7690 (2021)  
Target
Name:
Cyclic GMP-AMP synthase
Synonyms:
2'3'-cGAMP synthase CGAS_MOUSE Mab-21 domain-containing protein 1 Synonyms=Mb21d1 m-cGAS
Type:
PROTEIN
Mol. Mass.:
58224.36
Organism:
Mus musculus
Description:
ChEMBL_119133
Residue:
507
  
Inhibitor
Name:
BDBM50582694
Synonyms:
CHEMBL5091837
Type:
Small organic molecule
Emp. Form.:
C21H21Cl2N3O4
Mol. Mass.:
450.315
SMILES:
COc1ccc(OC)c2c1NC13CN(CCC21Nc1c3ccc(Cl)c1Cl)C(=O)CO
: