Target
Toll-like receptor 9
Ligand
BDBM50582807
Substrate
Meas. Tech.
ChEMBL_2155725 (CHEMBL5040385)
IC50
39±n/a nM
Citation
 Sabnis, RW Spiro(isobenzofuranazetidine) Compounds for Treating Autoimmune Diseases. ACS Med Chem Lett 12:1359-1360 (2021)  
Target
Name:
Toll-like receptor 9
Synonyms:
CD_antigen: CD289 TLR9_HUMAN
Type:
Enzyme
Mol. Mass.:
115889.91
Organism:
Homo sapiens (Human)
Description:
Q9NR96
Residue:
1032
  
Inhibitor
Name:
BDBM50582807
Synonyms:
CHEMBL5076307
Type:
Small organic molecule
Emp. Form.:
C31H35N7O3
Mol. Mass.:
554.6609
SMILES:
[H][C@@]12CN(C[C@@]1([H])OCCN2)c1cnc2c(COC22CN(C[C@H]3CN(C[C@@H](C)O3)c3ccc(C#N)c4nc([2H])ccc34)C2)c1
: