Target
Alpha-synuclein
Ligand
BDBM50389294
Substrate
Meas. Tech.
ChEMBL_2155874 (CHEMBL5040534)
Kd
60±n/a nM
Citation
 Bian, JLiu, YQHe, JLin, XQiu, CYYu, WBShen, YZhu, ZYYe, DYWang, JChu, Y Discovery of styrylaniline derivatives as novel alpha-synuclein aggregates ligands. Eur J Med Chem 226:0 (2021)  
Target
Name:
Alpha-synuclein
Synonyms:
NACP SNCA | SYUA_HUMAN
Type:
Protein
Mol. Mass.:
14451.42
Organism:
Homo sapiens (Human)
Description:
P37840
Residue:
140
  
Inhibitor
Name:
BDBM50389294
Synonyms:
CHEMBL2063787
Type:
Small organic molecule
Emp. Form.:
C13H10N2O3S
Mol. Mass.:
274.295
SMILES:
COc1ccc2Nc3ccc(cc3Sc2c1)[N+]([O-])=O
: