Target
Alpha-synuclein
Ligand
BDBM50582828
Substrate
Meas. Tech.
ChEMBL_2155874 (CHEMBL5040534)
Kd
490±n/a nM
Citation
 Bian, JLiu, YQHe, JLin, XQiu, CYYu, WBShen, YZhu, ZYYe, DYWang, JChu, Y Discovery of styrylaniline derivatives as novel alpha-synuclein aggregates ligands. Eur J Med Chem 226:0 (2021)  
Target
Name:
Alpha-synuclein
Synonyms:
NACP SNCA | SYUA_HUMAN
Type:
Protein
Mol. Mass.:
14451.42
Organism:
Homo sapiens (Human)
Description:
P37840
Residue:
140
  
Inhibitor
Name:
BDBM50582828
Synonyms:
CHEMBL5069753
Type:
Small organic molecule
Emp. Form.:
C21H16FNO
Mol. Mass.:
317.3562
SMILES:
Fc1ccc(\C=C\c2cccc(NC(=O)c3ccccc3)c2)cc1
: