Target
Alpha-synuclein
Ligand
BDBM50582848
Substrate
Meas. Tech.
ChEMBL_2155874 (CHEMBL5040534)
Kd
420±n/a nM
Citation
 Bian, JLiu, YQHe, JLin, XQiu, CYYu, WBShen, YZhu, ZYYe, DYWang, JChu, Y Discovery of styrylaniline derivatives as novel alpha-synuclein aggregates ligands. Eur J Med Chem 226:0 (2021)  
Target
Name:
Alpha-synuclein
Synonyms:
NACP SNCA | SYUA_HUMAN
Type:
Protein
Mol. Mass.:
14451.42
Organism:
Homo sapiens (Human)
Description:
P37840
Residue:
140
  
Inhibitor
Name:
BDBM50582848
Synonyms:
CHEMBL5092932
Type:
Small organic molecule
Emp. Form.:
C21H18N2O2
Mol. Mass.:
330.3798
SMILES:
COc1ccc(\C=C\c2ccccc2NC(=O)c2ccncc2)cc1
: