Target
Tyrosine-protein phosphatase non-receptor type 5
Ligand
BDBM50583249
Substrate
Meas. Tech.
ChEMBL_2156794 (CHEMBL5041454)
Ki
2070±n/a nM
Citation
 Szedlacsek, HSBajusz, DBadea, RAPop, ABic?, CCRavasz, LMittli, DMátyás, DNecula-Petr?reanu, GMunteanu, CVAPapp, IJuhász, GHritcu, LKeser?, GMSzedlacsek, SE Designed Peptide Inhibitors of STEP Phosphatase-GluA2 AMPA Receptor Interaction Enhance the Cognitive Performance in Rats. J Med Chem 65:217-233 (2022)  
Target
Name:
Tyrosine-protein phosphatase non-receptor type 5
Synonyms:
PTN5_HUMAN Tyrosine-protein phosphatase non-receptor type 5 | Tyrosine-protein phosphatase non-receptor type 5 isoform a
Type:
Enzyme Catalytic Domain
Mol. Mass.:
63510.68
Organism:
Homo sapiens (Human)
Description:
gi_90652859
Residue:
565
  
Inhibitor
Name:
BDBM50583249
Synonyms:
CHEMBL5071305
Type:
Small organic molecule
Emp. Form.:
C29H39N6O12P
Mol. Mass.:
694.6267
SMILES:
CC(C)[C@H](NC(=O)[C@H](CC(N)=O)NC(=O)[C@H](Cc1ccc(O)cc1)NC(=O)CN)C(=O)N[C@@H](Cc1ccc(OP(O)(O)=O)cc1)C(O)=O
: