Target
Solute carrier family 15 member 1
Ligand
BDBM50152064
Substrate
Meas. Tech.
ChEMBL_303277 (CHEMBL876384)
Ki
19000±n/a nM
Citation
 Våbenø, JNielsen, CUIngebrigtsen, TLejon, TSteffansen, BLuthman, K Dipeptidomimetic ketomethylene isosteres as pro-moieties for drug transport via the human intestinal di-/tripeptide transporter hPEPT1: design, synthesis, stability, and biological investigations. J Med Chem 47:4755-65 (2004)  
Target
Name:
Solute carrier family 15 member 1
Synonyms:
Intestinal H(+)/peptide cotransporter Oligopeptide transporter, small intestine isoform Peptide transporter 1 SLC15A1
Type:
PROTEIN
Mol. Mass.:
78818.07
Organism:
Homo sapiens (Human)
Description:
ChEMBL_1488839
Residue:
708
  
Inhibitor
Name:
BDBM50152064
Synonyms:
2-(3-Amino-4-methyl-2-oxo-pentyl)-succinic acid 4-benzyl ester | CHEMBL188947
Type:
Small organic molecule
Emp. Form.:
C17H23NO5
Mol. Mass.:
321.3682
SMILES:
CC(C)[C@H](N)C(=O)C[C@@H](CC(=O)OCc1ccccc1)C(O)=O
: