Target
5'-nucleotidase
Ligand
BDBM50546335
Substrate
Meas. Tech.
ChEMBL_2157215 (CHEMBL5041875)
Ki
2.2±n/a nM
Citation
 Scortichini, MIdris, RMMoschütz, SKeim, ASalmaso, VDobelmann, COliva, PLosenkova, KIrjala, HVaittinen, SSandholm, JYegutkin, GGSträter, NJunker, AMüller, CEJacobson, KA Structure-Activity Relationship of 3-Methylcytidine-5'-?,?-methylenediphosphates as CD73 Inhibitors. J Med Chem 65:2409-2433 (2022)  
Target
Name:
5'-nucleotidase
Synonyms:
5'-NT 5NTD_HUMAN Ecto-5'-nucleotidase NT5 NTE
Type:
Enzyme
Mol. Mass.:
63371.54
Organism:
Homo sapiens (Human)
Description:
P21589
Residue:
574
  
Inhibitor
Name:
BDBM50546335
Synonyms:
CHEMBL4755577
Type:
Small organic molecule
Emp. Form.:
C18H23N5O9P2
Mol. Mass.:
515.3508
SMILES:
O[C@@H]1[C@@H](COP(O)(=O)CP(O)(O)=O)O[C@H]([C@@H]1O)n1cnc2c(NCc3ccccc3)ncnc12
: