Target
Chymotrypsinogen B
Ligand
BDBM50152755
Substrate
Meas. Tech.
ChEMBL_302381 (CHEMBL830349)
Ki
>50000±n/a nM
Citation
 Yip, YVictor, FLamar, JJohnson, RWang, QMGlass, JIYumibe, NWakulchik, MMunroe, JChen, SH P4 and P1' optimization of bicycloproline P2 bearing tetrapeptidyl alpha-ketoamides as HCV protease inhibitors. Bioorg Med Chem Lett 14:5007-11 (2004)  
Target
Name:
Chymotrypsinogen B
Synonyms:
A0A2R8YG87_HUMAN CTRB1 Chymotrypsin B chain B Chymotrypsinogen B
Type:
PROTEIN
Mol. Mass.:
27871.19
Organism:
Homo sapiens (Human)
Description:
ChEMBL_216634
Residue:
263
  
Inhibitor
Name:
BDBM50152755
Synonyms:
2-((S)-2-{(S)-3-Methoxy-2-[(pyrazine-2-carbonyl)-amino]-butyrylamino}-3,3-dimethyl-butyryl)-octahydro-cyclopenta[c]pyrrole-1-carboxylic acid (1-cyclopropylaminooxalyl-butyl)-amide | CHEMBL2371796
Type:
Small organic molecule
Emp. Form.:
C33H49N7O7
Mol. Mass.:
655.7849
SMILES:
CCC[C@H](NC(=O)[C@@H]1C2CCCC2CN1C(=O)[C@@H](NC(=O)[C@@H](NC(=O)c1cnccn1)[C@@H](C)OC)C(C)(C)C)C(=O)C(=O)NC1CC1
: