Target
Histone deacetylase 6
Ligand
BDBM50583624
Substrate
Meas. Tech.
ChEMBL_2157819 (CHEMBL5042569)
Ki
0.700000±n/a nM
Citation
 Olaoye, OOWatson, PRNawar, NGeletu, MSedighi, ABukhari, SRaouf, YSManaswiyoungkul, PErdogan, FAbdeldayem, ACabral, ADHassan, MMToutah, KShouksmith, AEGawel, JMIsraelian, JRadu, TBKachhiyapatel, Nde Araujo, EDChristianson, DWGunning, PT Unique Molecular Interaction with the Histone Deacetylase 6 Catalytic Tunnel: Crystallographic and Biological Characterization of a Model Chemotype. J Med Chem 64:2691-2704 (2021)  
Target
Name:
Histone deacetylase 6
Synonyms:
Cereblon/Histone deacetylase 6 HDAC6 Histone deacetylase 6 (HDAC6) KIAA0901 | ORF Names:JM21
Type:
Chromatin regulator; hydrolase; repressor
Mol. Mass.:
131381.51
Organism:
Homo sapiens (Human)
Description:
Q9UBN7
Residue:
1215
  
Inhibitor
Name:
BDBM50583624
Synonyms:
CHEMBL5075135
Type:
Small organic molecule
Emp. Form.:
C20H15F4N3O4S
Mol. Mass.:
469.409
SMILES:
ONC(=O)c1ccc(CN(Cc2cccnc2)S(=O)(=O)c2cc(F)c(F)c(F)c2F)cc1
: