Target
Adenosine receptor A1
Ligand
BDBM50583640
Substrate
Meas. Tech.
ChEMBL_2157916 (CHEMBL5042666)
Ki
0.288403±n/a nM
Citation
 Comeo, ETrinh, PNguyen, ATNowell, CJKindon, NDSoave, MStoddart, LAWhite, JMHill, SJKellam, BHalls, MLMay, LTScammells, PJ Development and Application of Subtype-Selective Fluorescent Antagonists for the Study of the Human Adenosine A J Med Chem 64:6670-6695 (2021)  
Target
Name:
Adenosine receptor A1
Synonyms:
A1 adenosine receptor (hA1) AA1R_HUMAN ADORA1 Adenosine A1-receptor Adenosine receptor A1 (hA1) | Adenosine transporter (AdT)
Type:
G Protein-Coupled Receptor (GPCR)
Mol. Mass.:
36520.92
Organism:
Homo sapiens (Human)
Description:
P30542
Residue:
326
  
Inhibitor
Name:
BDBM50583640
Synonyms:
CHEMBL5075285
Type:
Small organic molecule
Emp. Form.:
C57H70BF2N11O8S
Mol. Mass.:
1118.107
SMILES:
CCCn1c2nc([nH]c2c(=O)n(CCC)c1=O)C12CCC(CC1)(CC2)C(=O)NCCNC(=O)CCNC(=O)CCNC(=O)CCCCCNC(=O)COc1ccc(\C=C\C2=[N+]3C(C=C2)=Cc2ccc(-c4cccs4)n2[B-]3(F)F)cc1
: