Target
Fatty acid-binding protein, adipocyte
Ligand
BDBM50152850
Substrate
Meas. Tech.
ChEMBL_305906 (CHEMBL832621)
IC50
930.0±n/a nM
Citation
 Lehmann, FHaile, SAxen, EMedina, CUppenberg, JSvensson, SLundbäck, TRondahl, LBarf, T Discovery of inhibitors of human adipocyte fatty acid-binding protein, a potential type 2 diabetes target. Bioorg Med Chem Lett 14:4445-8 (2004)  
Target
Name:
Fatty acid-binding protein, adipocyte
Synonyms:
A-FABP ALBP FABP4 Fatty acid binding protein adipocyte Fatty acid-binding protein 4 (FABP4)
Type:
Enzyme
Mol. Mass.:
14719.23
Organism:
Homo sapiens (Human)
Description:
P15090
Residue:
132
  
Inhibitor
Name:
BDBM50152850
Synonyms:
1-HEXYLDECANOIC ACID Hexadecanoic acid Palmitic acid (PA)
Type:
Small organic molecule
Emp. Form.:
C16H32O2
Mol. Mass.:
256.4241
SMILES:
CCCCCCCCCCCCCCCC(O)=O
: