Target
Dual specificity tyrosine-phosphorylation-regulated kinase 1A
Ligand
BDBM50583761
Substrate
Meas. Tech.
ChEMBL_2158059 (CHEMBL5042809)
IC50
>300±n/a nM
Citation
 Weber, CSipos, MPaczal, ABalint, BKun, VFoloppe, NDokurno, PMassey, AJWalmsley, DLHubbard, REMurray, JBenwell, KEdmonds, TDemarles, DBruno, ABurbridge, MCruzalegui, FKotschy, A Structure-Guided Discovery of Potent and Selective DYRK1A Inhibitors. J Med Chem 64:6745-6764 (2021)  
Target
Name:
Dual specificity tyrosine-phosphorylation-regulated kinase 1A
Synonyms:
DYR1A_HUMAN DYRK1A Dual specificity YAK1-related kinase 1A (Dyrk1A) Dual-specificity tyrosine-phosphorylation regulated kinase 1A HP86 MNBH
Type:
Enzyme
Mol. Mass.:
85616.61
Organism:
Homo sapiens (Human)
Description:
Q13627
Residue:
763
  
Inhibitor
Name:
BDBM50583761
Synonyms:
CHEMBL5079873
Type:
Small organic molecule
Emp. Form.:
C20H21N7O
Mol. Mass.:
375.427
SMILES:
C[C@@H](Cn1c(C)nc2ccc(nc12)-c1cc(N)nc(N)c1)Oc1ccccn1
: