Target
Neuropeptide FF receptor 2
Ligand
BDBM50565180
Substrate
Meas. Tech.
ChEMBL_2158117 (CHEMBL5042867)
Ki
824±n/a nM
Citation
 Quillet, RSchneider, SUtard, VDrieu la Rochelle, AElhabazi, KHenningsen, JBGizzi, PSchmitt, MKugler, VSimonneaux, VIlien, BSimonin, FBihel, F Identification of an  J Med Chem 64:7555-7564 (2021)  
Target
Name:
Neuropeptide FF receptor 2
Synonyms:
G-protein coupled receptor 74 NPFF2_MOUSE Npff2 | Npffr2
Type:
PROTEIN
Mol. Mass.:
47466.10
Organism:
Mus musculus
Description:
ChEMBL_119166
Residue:
417
  
Inhibitor
Name:
BDBM50565180
Synonyms:
CHEMBL4776204
Type:
Small organic molecule
Emp. Form.:
C28H32N6O3
Mol. Mass.:
500.5921
SMILES:
NC(=N)NCCC[C@@H](NC(=O)C(c1ccccc1)c1ccccc1)C(=O)N[C@@H](C(N)=O)c1ccccc1
: