Target
Vasopressin V1a receptor
Ligand
BDBM50583877
Substrate
Meas. Tech.
ChEMBL_2158237 (CHEMBL5042987)
Ki
0.300000±n/a nM
Citation
 Szeleczky, ZSzakács, ZBozó, ÉBaska, FVukics, KLévai, STemesvári, KVass, EBéni, ZKrámos, BMagdó, ISzántay, CKóti, JDomány-Kovács, KGreiner, IBata, I Synthesis and Characterization of New V J Med Chem 64:10445-10468 (2021)  
Target
Name:
Vasopressin V1a receptor
Synonyms:
AVPR V1a AVPR1A V1AR_HUMAN VASOPRESSIN V1A Vasopressin V1 receptor Vasopressin receptor
Type:
Receptor
Mol. Mass.:
46820.18
Organism:
Homo sapiens (Human)
Description:
P37288
Residue:
418
  
Inhibitor
Name:
BDBM50583877
Synonyms:
CHEMBL5070261
Type:
Small organic molecule
Emp. Form.:
C22H23ClN4O2
Mol. Mass.:
410.897
SMILES:
OC1Cc2nnc([C@H]3CC[C@@H](CC3)Oc3ccccn3)n2-c2ccc(Cl)cc2C1
: