Target
Acetylcholinesterase
Ligand
BDBM10958
Substrate
Meas. Tech.
ChEMBL_2158896 (CHEMBL5043646)
IC50
1560±n/a nM
Citation
 Liu, DZhang, HWang, YLiu, WYin, GWang, DLi, JShi, TWang, Z Design, synthesis, and biological evaluation of carbamate derivatives of N-salicyloyl tryptamine as multifunctional agents for the treatment of Alzheimer's disease. Eur J Med Chem 229:0 (2022)  
Target
Name:
Acetylcholinesterase
Synonyms:
ACES_HUMAN Acetylcholinesterase (AChE) | Acetylcholinesterase (human AChE)
Type:
Enzyme
Mol. Mass.:
67792.70
Organism:
Homo sapiens (Human)
Description:
P22303
Residue:
614
  
Inhibitor
Name:
BDBM10958
Synonyms:
(3aS,8aR)-1,3a,8-trimethyl-1H,2H,3H,3aH,8H,8aH-pyrrolo[2,3-b]indol-5-yl N-phenylcarbamate US10864192, Compound (-)-Phenserine phenserine.tartaric acid
Type:
Small organic molecule
Emp. Form.:
C20H23N3O2
Mol. Mass.:
337.4155
SMILES:
[H][C@]12N(C)CC[C@@]1(C)c1cc(OC(=O)Nc3ccccc3)ccc1N2C
: