Target
Serine/threonine-protein kinase Sgk1
Ligand
BDBM50584096
Substrate
Meas. Tech.
ChEMBL_2158996 (CHEMBL5043746)
IC50
<1.000000±n/a nM
Citation
 Halland, NSchmidt, FWeiss, TLi, ZCzech, JSaas, JDing-Pfennigdorff, DDreyer, MKStrübing, CNazare, M Rational Design of Highly Potent, Selective, and Bioavailable SGK1 Protein Kinase Inhibitors for the Treatment of Osteoarthritis. J Med Chem 65:1567-1584 (2022)  
Target
Name:
Serine/threonine-protein kinase Sgk1
Synonyms:
SGK SGK1_HUMAN Serine/threonine-protein kinase Sgk1 (SGK) Serum/glucocorticoid-regulated kinase 1 (SGK1)
Type:
Other Protein Type
Mol. Mass.:
48954.40
Organism:
Homo sapiens (Human)
Description:
Recombinant human SGK-1 enzyme produced in a baculovirus system.
Residue:
431
  
Inhibitor
Name:
BDBM50584096
Synonyms:
CHEMBL5078023
Type:
Small organic molecule
Emp. Form.:
C23H20Cl2N6O3S
Mol. Mass.:
531.414
SMILES:
Clc1cccc(c1Cl)S(=O)(=O)Nc1ccc(cc1)-c1cc(C(=O)N[C@@H]2CCNC2)c2cn[nH]c2n1
: