Target
Serine/threonine-protein kinase Sgk1
Ligand
BDBM268850
Substrate
Meas. Tech.
ChEMBL_2158996 (CHEMBL5043746)
IC50
1.000000±n/a nM
Citation
 Halland, NSchmidt, FWeiss, TLi, ZCzech, JSaas, JDing-Pfennigdorff, DDreyer, MKStrübing, CNazare, M Rational Design of Highly Potent, Selective, and Bioavailable SGK1 Protein Kinase Inhibitors for the Treatment of Osteoarthritis. J Med Chem 65:1567-1584 (2022)  
Target
Name:
Serine/threonine-protein kinase Sgk1
Synonyms:
SGK SGK1_HUMAN Serine/threonine-protein kinase Sgk1 (SGK) Serum/glucocorticoid-regulated kinase 1 (SGK1)
Type:
Other Protein Type
Mol. Mass.:
48954.40
Organism:
Homo sapiens (Human)
Description:
Recombinant human SGK-1 enzyme produced in a baculovirus system.
Residue:
431
  
Inhibitor
Name:
BDBM268850
Synonyms:
US9718825, Example 255 | US9718825, Example 261
Type:
Small organic molecule
Emp. Form.:
C23H20ClF3N6O3S
Mol. Mass.:
552.957
SMILES:
Cc1n[nH]c2nc(nc(OC3CCNCC3(F)F)c12)-c1ccc(NS(=O)(=O)c2cc(Cl)ccc2F)cc1
: