Target
Dimer of Protein farnesyltransferase subunit beta
Ligand
BDBM50153172
Substrate
Meas. Tech.
ChEMBL_306501 (CHEMBL828106)
IC50
0.37±n/a nM
Citation
 Lin, NHWang, LWang, XWang, GTCohen, JGu, WZZhang, HRosenberg, SHSham, HL Synthesis and biological evaluation of 1-benzyl-5-(3-biphenyl-2-yl-propyl)-1H-imidazole as novel farnesyltransferase inhibitor. Bioorg Med Chem Lett 14:5057-62 (2004)  
Target
Name:
Dimer of Protein farnesyltransferase subunit beta
Synonyms:
Protein Farnesyltransferase (PFT) Chain B
Type:
Mol. Mass.:
Description:
ASSAY_ID of EBI is 51428
Components:
This complex has 3 components.
Component 1
Name:
Protein farnesyltransferase subunit beta
Synonyms:
CAAX farnesyltransferase subunit alpha FNTB FTase-alpha GGTase-I-alpha Protein farnesyl/geranylgeranyl transferase Protein farnesyltransferase subunit beta Protein farnesyltransferase/geranylgeranyltransferase type-1 subunit alpha Ras proteins prenyltransferase subunit beta | Type I protein geranyl-geranyltransferase subunit alpha
Type:
Enzyme Subunit
Mol. Mass.:
48766.02
Organism:
Homo sapiens (Human)
Description:
Protein farnesyltransferase subunit beta
Residue:
437
  
Component 2
Name:
Protein farnesyltransferase subunit beta
Synonyms:
CAAX farnesyltransferase subunit alpha FNTB FTase-alpha GGTase-I-alpha Protein farnesyl/geranylgeranyl transferase Protein farnesyltransferase subunit beta Protein farnesyltransferase/geranylgeranyltransferase type-1 subunit alpha Ras proteins prenyltransferase subunit beta | Type I protein geranyl-geranyltransferase subunit alpha
Type:
Enzyme Subunit
Mol. Mass.:
48766.02
Organism:
Homo sapiens (Human)
Description:
Protein farnesyltransferase subunit beta
Residue:
437
  
Inhibitor
Name:
BDBM50153172
Synonyms:
6-(((1-(4-cyanobenzyl)-1H-imidazol-5-yl)methoxy)methyl)-3'-(trifluoromethoxy)biphenyl-3-carbonitrile 6-[3-(4-cyano-benzyl)-3H-imidazol-4-ylmethoxymethyl]-3'-trifluoromethoxy-biphenyl-3-carbonitrile | CHEMBL181748
Type:
Small organic molecule
Emp. Form.:
C27H19F3N4O2
Mol. Mass.:
488.4606
SMILES:
FC(F)(F)Oc1cccc(c1)-c1cc(ccc1COCc1cncn1Cc1ccc(cc1)C#N)C#N
: