Target
Geranylgeranyl transferase type-1 subunit beta/Protein farnesyltransferase/geranylgeranyltransferase type-1 subunit alpha
Ligand
BDBM50153177
Substrate
Meas. Tech.
ChEMBL_306742 (CHEMBL832329)
IC50
10000±n/a nM
Citation
 Lin, NHWang, LWang, XWang, GTCohen, JGu, WZZhang, HRosenberg, SHSham, HL Synthesis and biological evaluation of 1-benzyl-5-(3-biphenyl-2-yl-propyl)-1H-imidazole as novel farnesyltransferase inhibitor. Bioorg Med Chem Lett 14:5057-62 (2004)  
Target
Name:
Geranylgeranyl transferase type-1 subunit beta/Protein farnesyltransferase/geranylgeranyltransferase type-1 subunit alpha
Synonyms:
Geranylgeranyl transferase type I Geranylgeranyl transferase type I beta/Protein farnesyltransferase/geranylgeranyltransferase type I alpha subunit
Type:
Mol. Mass.:
Description:
ASSAY_ID of EBI is 70196
Components:
This complex has 2 components.
Component 1
Name:
Protein farnesyltransferase/geranylgeranyltransferase type-1 subunit alpha
Synonyms:
CAAX farnesyltransferase alpha subunit FNTA_HUMAN FTase-alpha Geranylgeranyl Transferase (GGTase-I) Chain A Protein Farnesyltransferase (PFT) Chain A Protein farnesyltransferase Protein farnesyltransferase/geranylgeranyltransferase type I alpha subunit | Ras proteins prenyltransferase alpha
Type:
Enzyme
Mol. Mass.:
44392.46
Organism:
Homo sapiens (Human)
Description:
Recombinant human FTase.
Residue:
379
  
Component 2
Name:
Geranylgeranyl transferase type-1 subunit beta
Synonyms:
2.5.1.59 Geranylgeranyl transferase type I Geranylgeranyl transferase type I subunit beta PGGT1B Protein farnesyl/geranylgeranyl transferase | Type I protein geranyl-geranyltransferase subunit beta
Type:
Mol. Mass.:
42369.84
Organism:
Homo sapiens (Human)
Description:
Residue:
377
  
Inhibitor
Name:
BDBM50153177
Synonyms:
CHEMBL187809 | N-[3-(4-Cyano-benzyl)-3H-imidazol-4-ylmethyl]-N-(5-cyano-3''-ethoxy-biphenyl-2-ylmethyl)-methanesulfonamide
Type:
Small organic molecule
Emp. Form.:
C29H27N5O3S
Mol. Mass.:
525.621
SMILES:
CCOc1cccc(c1)-c1cc(ccc1CN(Cc1cncn1Cc1ccc(cc1)C#N)S(C)(=O)=O)C#N
: