Target
Protein farnesyltransferase subunit beta/geranylgeranyltransferase type-1 subunit alpha
Ligand
BDBM50153177
Substrate
Meas. Tech.
ChEMBL_310170 (CHEMBL824826)
EC50
100±n/a nM
Citation
 Lin, NHWang, LWang, XWang, GTCohen, JGu, WZZhang, HRosenberg, SHSham, HL Synthesis and biological evaluation of 1-benzyl-5-(3-biphenyl-2-yl-propyl)-1H-imidazole as novel farnesyltransferase inhibitor. Bioorg Med Chem Lett 14:5057-62 (2004)  
Target
Name:
Protein farnesyltransferase subunit beta/geranylgeranyltransferase type-1 subunit alpha
Synonyms:
Protein farnesyltransferase | Protein farnesyltransferase beta/geranylgeranyltransferase type I alpha subunit
Type:
Mol. Mass.:
Description:
ASSAY_ID of EBI is 38702
Components:
This complex has 2 components.
Component 1
Name:
Protein farnesyltransferase/geranylgeranyltransferase type-1 subunit alpha
Synonyms:
CAAX farnesyltransferase subunit alpha FTase-alpha GGTase-I-alpha Protein farnesyltransferase/geranylgeranyltransferase type-1 subunit alpha Type I protein geranyl-geranyltransferase subunit alpha
Type:
PROTEIN
Mol. Mass.:
43994.09
Organism:
Mus musculus
Description:
EBI_10570
Residue:
377
  
Component 2
Name:
Protein farnesyltransferase subunit beta
Synonyms:
FNTB_MOUSE Protein farnesyltransferase
Type:
PROTEIN
Mol. Mass.:
48811.61
Organism:
Mus musculus
Description:
EBI_12341
Residue:
437
  
Inhibitor
Name:
BDBM50153177
Synonyms:
CHEMBL187809 | N-[3-(4-Cyano-benzyl)-3H-imidazol-4-ylmethyl]-N-(5-cyano-3''-ethoxy-biphenyl-2-ylmethyl)-methanesulfonamide
Type:
Small organic molecule
Emp. Form.:
C29H27N5O3S
Mol. Mass.:
525.621
SMILES:
CCOc1cccc(c1)-c1cc(ccc1CN(Cc1cncn1Cc1ccc(cc1)C#N)S(C)(=O)=O)C#N
: