Target
Melanin-concentrating hormone receptor 1
Ligand
BDBM50153206
Substrate
Meas. Tech.
ChEMBL_306754 (CHEMBL832647)
IC50
240±n/a nM
Citation
 Receveur, JMBjurling, EUlven, TLittle, PBNørregaard, PKHögberg, T 4-Acylamino-and 4-ureidobenzamides as melanin-concentrating hormone (MCH) receptor 1 antagonists. Bioorg Med Chem Lett 14:5075-80 (2004)  
Target
Name:
Melanin-concentrating hormone receptor 1
Synonyms:
G-protein coupled receptor 24 MCH receptor 1 MCH-R1 MCHR-1 MCHR1_HUMAN Melanin-Concentrating Hormone Receptor 1 (MCH1R) Melanin-concentrating hormone receptor 1 (MCH-1) Melanin-concentrating hormone receptor 1 (MCHR-1) SLC-1 Somatostatin receptor-like protein
Type:
G Protein-Coupled Receptor (GPCR)
Mol. Mass.:
45976.27
Organism:
Homo sapiens (Human)
Description:
Membranes from CHO-K1 cells stably expressing human MCH1R were used in assays.
Residue:
422
  
Inhibitor
Name:
BDBM50153206
Synonyms:
2-Methoxy-4-[3-(4-phenoxy-phenyl)-ureido]-N-(3-piperidin-1-yl-propyl)-benzamide | CHEMBL182554
Type:
Small organic molecule
Emp. Form.:
C29H34N4O4
Mol. Mass.:
502.6047
SMILES:
COc1cc(NC(=O)Nc2ccc(Oc3ccccc3)cc2)ccc1C(=O)NCCCN1CCCCC1
: