Target
Nuclear receptor subfamily 2 group E member 1
Ligand
BDBM50584389
Substrate
Meas. Tech.
ChEMBL_2159734 (CHEMBL5044484)
Kd
1600±n/a nM
Citation
 Faudone, GZhubi, RCelik, FKnapp, SChaikuad, AHeering, JMerk, D Design of a Potent TLX Agonist by Rational Fragment Fusion. J Med Chem 65:2288-2296 (2022)  
Target
Name:
Nuclear receptor subfamily 2 group E member 1
Synonyms:
NR2E1 Nuclear receptor TLX TLX hTll
Type:
PROTEIN
Mol. Mass.:
42606.25
Organism:
Homo sapiens
Description:
ChEMBL_104473
Residue:
385
  
Inhibitor
Name:
BDBM50584389
Synonyms:
CHEMBL5080383
Type:
Small organic molecule
Emp. Form.:
C25H23F3N4O2
Mol. Mass.:
468.4709
SMILES:
CCCCOc1cc(C(=O)Nc2cc(cc(c2)C(F)(F)F)-n2cnc(C)c2)c2ccccc2n1
: