Target
Melatonin receptor type 1A
Ligand
BDBM50153420
Substrate
Meas. Tech.
ChEMBL_310710 (CHEMBL838055)
EC50
0.6±n/a nM
Citation
 Sun, LQTakaki, KChen, JIben, LKnipe, JOPajor, LMahle, CDRyan, EXu, C N-[2-[2-(4-Phenylbutyl)benzofuran-4-yl]cyclopropylmethyl]acetamide: an orally bioavailable melatonin receptor agonist. Bioorg Med Chem Lett 14:5157-60 (2004)  
Target
Name:
Melatonin receptor type 1A
Synonyms:
MTNR1A MTR1A_HUMAN Mel1a melatonin receptor Melatonin receptor Melatonin receptor type 1 (MT1) | Melatonin receptor type 1A
Type:
Enzyme
Mol. Mass.:
39392.94
Organism:
Homo sapiens (Human)
Description:
P48039
Residue:
350
  
Inhibitor
Name:
BDBM50153420
Synonyms:
1N-[2-[2-(4-phenylbutyl)benzo[b]furan-4-yl]-(1R,2R)-cyclopropylmethyl]acetamide | CHEMBL186586
Type:
Small organic molecule
Emp. Form.:
C24H27NO2
Mol. Mass.:
361.4767
SMILES:
CC(=O)NC[C@@H]1CC1c1cccc2oc(CCCCc3ccccc3)cc12
: