Target
Stimulator of interferon genes protein
Ligand
BDBM50584868
Substrate
Meas. Tech.
ChEMBL_2160786 (CHEMBL5045536)
IC50
>100000±n/a nM
Citation
 Cherney, ECZhang, LLo, JHuynh, TWei, DAhuja, VQuesnelle, CSchieven, GLFutran, ALocke, GALin, ZMonereau, LChaudhry, CBlum, JLi, SFereshteh, MLi-Wang, BGangwar, SPan, CChong, CZhu, XPosy, SLSack, JSZhang, PRuzanov, MHarner, MAkhtar, FSchroeder, GMVite, GFink, B Discovery of Non-Nucleotide Small-Molecule STING Agonists  J Med Chem 65:3518-3538 (2022)  
Target
Name:
Stimulator of interferon genes protein
Synonyms:
Endoplasmic reticulum interferon stimulator MMITA Mita STING_MOUSE Sting Synonyms=Eris Transmembrane protein 173 | mSTING
Type:
PROTEIN
Mol. Mass.:
42834.49
Organism:
Mus musculus
Description:
ChEMBL_119061
Residue:
378
  
Inhibitor
Name:
BDBM50584868
Synonyms:
CHEMBL5086556
Type:
Small organic molecule
Emp. Form.:
C19H12F4N4O4
Mol. Mass.:
436.3166
SMILES:
Fc1cc(C(=O)OCC(F)(F)F)c2oc(CNC(=O)c3cnn4cccnc34)cc2c1
: