Target
Stimulator of interferon genes protein
Ligand
BDBM50509050
Substrate
Meas. Tech.
ChEMBL_2160786 (CHEMBL5045536)
IC50
2.6±n/a nM
Citation
 Cherney, ECZhang, LLo, JHuynh, TWei, DAhuja, VQuesnelle, CSchieven, GLFutran, ALocke, GALin, ZMonereau, LChaudhry, CBlum, JLi, SFereshteh, MLi-Wang, BGangwar, SPan, CChong, CZhu, XPosy, SLSack, JSZhang, PRuzanov, MHarner, MAkhtar, FSchroeder, GMVite, GFink, B Discovery of Non-Nucleotide Small-Molecule STING Agonists  J Med Chem 65:3518-3538 (2022)  
Target
Name:
Stimulator of interferon genes protein
Synonyms:
Endoplasmic reticulum interferon stimulator MMITA Mita STING_MOUSE Sting Synonyms=Eris Transmembrane protein 173 | mSTING
Type:
PROTEIN
Mol. Mass.:
42834.49
Organism:
Mus musculus
Description:
ChEMBL_119061
Residue:
378
  
Inhibitor
Name:
BDBM50509050
Synonyms:
CHEMBL4438309
Type:
Small organic molecule
Emp. Form.:
C42H51N13O7
Mol. Mass.:
849.9372
SMILES:
CCn1nc(C)cc1C(=O)\N=c1/[nH]c2cc(cc(OC)c2n1C\C=C\Cn1c2c(OCCCN3CCOCC3)cc(cc2[nH]\c1=N/C(=O)c1cc(C)nn1CC)C(N)=O)C(N)=O
: