Target
Stimulator of interferon genes protein
Ligand
BDBM50511078
Substrate
Meas. Tech.
ChEMBL_2160786 (CHEMBL5045536)
IC50
1200±n/a nM
Citation
 Cherney, ECZhang, LLo, JHuynh, TWei, DAhuja, VQuesnelle, CSchieven, GLFutran, ALocke, GALin, ZMonereau, LChaudhry, CBlum, JLi, SFereshteh, MLi-Wang, BGangwar, SPan, CChong, CZhu, XPosy, SLSack, JSZhang, PRuzanov, MHarner, MAkhtar, FSchroeder, GMVite, GFink, B Discovery of Non-Nucleotide Small-Molecule STING Agonists  J Med Chem 65:3518-3538 (2022)  
Target
Name:
Stimulator of interferon genes protein
Synonyms:
Endoplasmic reticulum interferon stimulator MMITA Mita STING_MOUSE Sting Synonyms=Eris Transmembrane protein 173 | mSTING
Type:
PROTEIN
Mol. Mass.:
42834.49
Organism:
Mus musculus
Description:
ChEMBL_119061
Residue:
378
  
Inhibitor
Name:
BDBM50511078
Synonyms:
AS-1404 ASA404 DMXAA Vadimezan
Type:
Small organic molecule
Emp. Form.:
C17H14O4
Mol. Mass.:
282.2907
SMILES:
Cc1ccc2c(oc3c(CC(O)=O)cccc3c2=O)c1C
: