Target
Epidermal growth factor receptor
Ligand
BDBM50153880
Substrate
Meas. Tech.
ChEMBL_305999 (CHEMBL832673)
IC50
>33000±n/a nM
Citation
 Cumming, JGMcKenzie, CLBowden, SGCampbell, DMasters, DJBreed, JJewsbury, PJ Novel, potent and selective anilinoquinazoline and anilinopyrimidine inhibitors of p38 MAP kinase. Bioorg Med Chem Lett 14:5389-94 (2004)  
Target
Name:
Epidermal growth factor receptor
Synonyms:
EGF Receptor Substrate EGFR_HUMAN ERBB1 Epidermal Growth Factor Receptor erbB-1 Epidermal growth factor receptor (EGFR) HER1 Proto-oncogene c-ErbB-1 Tyrosine-Protein Kinase ErbB-1
Type:
Receptor Kinase Domain
Mol. Mass.:
134279.59
Organism:
Homo sapiens (Human)
Description:
P00533
Residue:
1210
  
Inhibitor
Name:
BDBM50153880
Synonyms:
CHEMBL364576 | N-[3-(6,7-Dimethoxy-quinazolin-4-ylamino)-4-methyl-phenyl]-3-dimethylamino-benzamide
Type:
Small organic molecule
Emp. Form.:
C26H27N5O3
Mol. Mass.:
457.5243
SMILES:
COc1cc2ncnc(Nc3cc(NC(=O)c4cccc(c4)N(C)C)ccc3C)c2cc1OC
: