Target
Dual specificity tyrosine-phosphorylation-regulated kinase 1A
Ligand
BDBM50335638
Substrate
Meas. Tech.
ChEMBL_2161415 (CHEMBL5046165)
IC50
7.0±n/a nM
Citation
 Powell, CEHatcher, JMJiang, JVatsan, PSChe, JGray, NS Selective Macrocyclic Inhibitors of DYRK1A/B. ACS Med Chem Lett 13:577-585 (2022)  
Target
Name:
Dual specificity tyrosine-phosphorylation-regulated kinase 1A
Synonyms:
DYR1A_HUMAN DYRK1A Dual specificity YAK1-related kinase 1A (Dyrk1A) Dual-specificity tyrosine-phosphorylation regulated kinase 1A HP86 MNBH
Type:
Enzyme
Mol. Mass.:
85616.61
Organism:
Homo sapiens (Human)
Description:
Q13627
Residue:
763
  
Inhibitor
Name:
BDBM50335638
Synonyms:
5-(3-Chlorophenylamino)benzo[c][2,6]naphthyridine-8-carboxylic acid CHEMBL1230165 US9062043, Table 13, Compound 17 | US9062043, Table 20b, Compound 12
Type:
Small organic molecule
Emp. Form.:
C19H12ClN3O2
Mol. Mass.:
349.77
SMILES:
OC(=O)c1ccc2c(c1)nc(Nc1cccc(Cl)c1)c1ccncc21
: