Target
Bone morphogenetic protein receptor type-2
Ligand
BDBM50585192
Substrate
Meas. Tech.
ChEMBL_2161747 (CHEMBL5046608)
IC50
2918±n/a nM
Citation
 Drewry, DHAnnor-Gyamfi, JKWells, CIPickett, JEDederer, VPreuss, FMathea, SAxtman, AD Identification of Pyrimidine-Based Lead Compounds for Understudied Kinases Implicated in Driving Neurodegeneration. J Med Chem 65:1313-1328 (2022)  
Target
Name:
Bone morphogenetic protein receptor type-2
Synonyms:
BMPR2 Bone Morphogenetic Protein Receptor type II (BMPR2) PPH1
Type:
PROTEIN
Mol. Mass.:
115194.11
Organism:
Homo sapiens (Human)
Description:
ChEMBL_774306
Residue:
1038
  
Inhibitor
Name:
BDBM50585192
Synonyms:
CHEMBL5088682
Type:
Small organic molecule
Emp. Form.:
C25H29N7O3S
Mol. Mass.:
507.608
SMILES:
NS(=O)(=O)c1ccc(CNc2nc(Nc3cccc(NC(=O)N4CCCC4)c3)ncc2C2CC2)cc1
: