Target
Sodium-dependent noradrenaline transporter
Ligand
BDBM50154365
Substrate
Meas. Tech.
ChEMBL_303519 (CHEMBL839633)
Ki
286±n/a nM
Citation
 Kung, HFNewman, SChoi, SROya, SHou, CZhuang, ZPActon, PDPlössl, KWinkler, JKung, MP 2-(2-(dimethylaminomethyl)phenoxy)-5-iodophenylamine: an improved serotonin transporter imaging agent. J Med Chem 47:5258-64 (2004)  
Target
Name:
Sodium-dependent noradrenaline transporter
Synonyms:
Monoamine transporter NET Noradrenaline Transporter (NET) Norepinephrine transporter protein (NET) SLC6A2 Sodium-dependent noradrenaline transporter (NET) | Solute carrier family 6 member 2
Type:
Multi-pass membrane protein
Mol. Mass.:
69337.72
Organism:
Homo sapiens (Human)
Description:
P23975
Residue:
617
  
Inhibitor
Name:
BDBM50154365
Synonyms:
2-(2-((dimethylamino)methyl)phenoxy)-5-iodoaniline CHEMBL186962
Type:
Small organic molecule
Emp. Form.:
C15H17IN2O
Mol. Mass.:
368.2128
SMILES:
CN(C)Cc1ccccc1Oc1ccc(I)cc1N
: