Target
Metabotropic glutamate receptor 5
Ligand
BDBM50151907
Substrate
Meas. Tech.
ChEMBL_303752 (CHEMBL829795)
Ki
186±n/a nM
Citation
 Huang, DPoon, SFChapman, DFChung, JCramer, MReger, TSRoppe, JRTehrani, LCosford, NDSmith, ND 2-(2-[3-(pyridin-3-yloxy)phenyl]-2H-tetrazol-5-yl) pyridine: a highly potent, orally active, metabotropic glutamate subtype 5 (mGlu5) receptor antagonist. Bioorg Med Chem Lett 14:5473-6 (2004)  
Target
Name:
Metabotropic glutamate receptor 5
Synonyms:
GRM5_RAT Grm5 Mglur5 metabotropic glutamate 5/1-C metabotropic glutamate 5a
Type:
Enzyme
Mol. Mass.:
131900.14
Organism:
Rattus norvegicus (Rat)
Description:
P31424
Residue:
1203
  
Inhibitor
Name:
BDBM50151907
Synonyms:
3-(5-Pyridin-2-yl-tetrazol-2-yl)-benzonitrile | CHEMBL365499
Type:
Small organic molecule
Emp. Form.:
C13H8N6
Mol. Mass.:
248.2428
SMILES:
N#Cc1cccc(c1)-n1nnc(n1)-c1ccccn1
: