Target
Metabotropic glutamate receptor 5
Ligand
BDBM50154977
Substrate
Meas. Tech.
ChEMBL_312889 (CHEMBL826437)
IC50
6.7±n/a nM
Citation
 Huang, DPoon, SFChapman, DFChung, JCramer, MReger, TSRoppe, JRTehrani, LCosford, NDSmith, ND 2-(2-[3-(pyridin-3-yloxy)phenyl]-2H-tetrazol-5-yl) pyridine: a highly potent, orally active, metabotropic glutamate subtype 5 (mGlu5) receptor antagonist. Bioorg Med Chem Lett 14:5473-6 (2004)  
Target
Name:
Metabotropic glutamate receptor 5
Synonyms:
GPRC1E GRM5_HUMAN metabotropic glutamate 5 | metabotropic glutamate 5a
Type:
Enzyme
Mol. Mass.:
132484.72
Organism:
Homo sapiens (Human)
Description:
Residue:
1212
  
Inhibitor
Name:
BDBM50154977
Synonyms:
2-{2-[3-fluoro-5-(pyridin-3-yloxy)phenyl]-2H-tetrazol-5-yl}pyridine | CHEMBL186151
Type:
Small organic molecule
Emp. Form.:
C17H11FN6O
Mol. Mass.:
334.3072
SMILES:
Fc1cc(Oc2cccnc2)cc(c1)-n1nnc(n1)-c1ccccn1
: