Target
Amine oxidase [flavin-containing] A
Ligand
BDBM50155444
Substrate
Meas. Tech.
ChEMBL_304820 (CHEMBL827909)
IC50
65000±n/a nM
Citation
 Núñez, MBMaguna, FPOkulik, NBCastro, EA QSAR modeling of the MAO inhibitory activity of xanthones derivatives. Bioorg Med Chem Lett 14:5611-7 (2004)  
Target
Name:
Amine oxidase [flavin-containing] A
Synonyms:
AOFA_HUMAN MAO-A Monoamine oxidase Monoamine oxidase type A (MAO A) Monoamine oxidase type A (MAOA)
Type:
Protein
Mol. Mass.:
59689.53
Organism:
Homo sapiens (Human)
Description:
P21397
Residue:
527
  
Inhibitor
Name:
BDBM50155444
Synonyms:
3-Hydroxy-4-methoxy-xanthen-9-one | CHEMBL185895
Type:
Small organic molecule
Emp. Form.:
C14H10O4
Mol. Mass.:
242.2268
SMILES:
COc1c(O)ccc2c1oc1ccccc1c2=O
: