Target
Transporter
Ligand
BDBM50155451
Substrate
Meas. Tech.
ChEMBL_303591 (CHEMBL829602)
Ki
2.03±n/a nM
Citation
 Peng, XZhang, AKula, NSBaldessarini, RJNeumeyer, JL Synthesis and amine transporter affinities of novel phenyltropane derivatives as potential positron emission tomography (PET) imaging agents. Bioorg Med Chem Lett 14:5635-9 (2004)  
Target
Name:
Transporter
Synonyms:
Monoamine transporters; Norepininephrine & dopamine | Norepinephrine Monoamine transporters
Type:
PROTEIN
Mol. Mass.:
66787.87
Organism:
Rattus norvegicus
Description:
ChEMBL_1463061
Residue:
597
  
Inhibitor
Name:
BDBM50155451
Synonyms:
3-(4-Bromo-phenyl)-8-(3-fluoro-propyl)-8-aza-bicyclo[3.2.1]octane-2-carboxylic acid 2-fluoro-ethyl ester | CHEMBL184123
Type:
Small organic molecule
Emp. Form.:
C19H24BrF2NO2
Mol. Mass.:
416.3
SMILES:
FCCCN1C2CCC1C(C(C2)c1ccc(Br)cc1)C(=O)OCCF
: