Target
Transporter
Ligand
BDBM50155457
Substrate
Meas. Tech.
ChEMBL_303591 (CHEMBL829602)
Ki
1.02±n/a nM
Citation
 Peng, XZhang, AKula, NSBaldessarini, RJNeumeyer, JL Synthesis and amine transporter affinities of novel phenyltropane derivatives as potential positron emission tomography (PET) imaging agents. Bioorg Med Chem Lett 14:5635-9 (2004)  
Target
Name:
Transporter
Synonyms:
Monoamine transporters; Norepininephrine & dopamine | Norepinephrine Monoamine transporters
Type:
PROTEIN
Mol. Mass.:
66787.87
Organism:
Rattus norvegicus
Description:
ChEMBL_1463061
Residue:
597
  
Inhibitor
Name:
BDBM50155457
Synonyms:
3-(4-Bromo-phenyl)-8-aza-bicyclo[3.2.1]octane-2-carboxylic acid methyl ester | CHEMBL365623
Type:
Small organic molecule
Emp. Form.:
C15H18BrNO2
Mol. Mass.:
324.213
SMILES:
COC(=O)C1C2CCC(CC1c1ccc(Br)cc1)N2
: