Target
Breakpoint cluster region protein
Ligand
BDBM50155562
Substrate
Meas. Tech.
ChEMBL_305348 (CHEMBL832728)
IC50
720±n/a nM
Citation
 Manley, PWBreitenstein, WBrüggen, JCowan-Jacob, SWFuret, PMestan, JMeyer, T Urea derivatives of STI571 as inhibitors of Bcr-Abl and PDGFR kinases. Bioorg Med Chem Lett 14:5793-7 (2004)  
Target
Name:
Breakpoint cluster region protein
Synonyms:
BCR BCR_HUMAN Breakpoint cluster region protein | D22S11
Type:
PROTEIN
Mol. Mass.:
142824.75
Organism:
Homo sapiens (Human)
Description:
ChEMBL_305348
Residue:
1271
  
Inhibitor
Name:
BDBM50155562
Synonyms:
1-[4-Methyl-3-(4-pyridin-3-yl-pyrimidin-2-ylamino)-phenyl]-3-(3-pyrrolidin-1-yl-phenyl)-urea | CHEMBL184742
Type:
Small organic molecule
Emp. Form.:
C27H27N7O
Mol. Mass.:
465.5496
SMILES:
Cc1ccc(NC(=O)Nc2cccc(c2)N2CCCC2)cc1Nc1nccc(n1)-c1cccnc1
: