Target
N6-adenosine-methyltransferase catalytic subunit
Ligand
BDBM50009672
Substrate
Meas. Tech.
ChEMBL_2168906 (CHEMBL5053965)
IC50
590±n/a nM
Citation
 Dolbois, ABedi, RKBochenkova, EMüller, AMoroz-Omori, EVHuang, DCaflisch, A 1,4,9-Triazaspiro[5.5]undecan-2-one Derivatives as Potent and Selective METTL3 Inhibitors. J Med Chem 64:12738-12760 (2021)  
Target
Name:
N6-adenosine-methyltransferase catalytic subunit
Synonyms:
2.1.1.348 MT-A70 MTA70_HUMAN N6-adenosine-methyltransferase 70 kDa subunit hMETTL3
Type:
PROTEIN
Mol. Mass.:
64471.71
Organism:
Homo sapiens
Description:
ChEMBL_120160
Residue:
580
  
Inhibitor
Name:
BDBM50009672
Synonyms:
AdoHcy S-(5'-adenosyl)-L-homocysteine S-[1-(adenin-9-yl)-1,5-dideoxy-beta-D-ribofuranos-5-yl]-L-homocysteine SAH US9175331, 1 | US9333217, S-Adenosyl-L-homocysteine (SAH)
Type:
Small organic molecule
Emp. Form.:
C14H20N6O5S
Mol. Mass.:
384.411
SMILES:
N[C@@H](CCSC[C@H]1O[C@H]([C@H](O)[C@@H]1O)n1cnc2c(N)ncnc12)C(O)=O
: