Target
Gamma-aminobutyric acid receptor subunit alpha-3/beta-3/gamma-2
Ligand
BDBM50156083
Substrate
Meas. Tech.
ChEMBL_303795 (CHEMBL829844)
Ki
0.77±n/a nM
Citation
 Chambers, MSAtack, JRCarling, RWCollinson, NCook, SMDawson, GRFerris, PHobbs, SCO'connor, DMarshall, GRycroft, WMacleod, AM An orally bioavailable, functionally selective inverse agonist at the benzodiazepine site of GABAA alpha5 receptors with cognition enhancing properties. J Med Chem 47:5829-32 (2004)  
Target
Name:
Gamma-aminobutyric acid receptor subunit alpha-3/beta-3/gamma-2
Synonyms:
GABA receptor alpha-3/beta-3/gamma-2 subunit | GABA-A receptor; alpha-3/beta-3/gamma-2
Type:
Mol. Mass.:
Description:
ASSAY_ID of EBI is 68410
Components:
This complex has 3 components.
Component 1
Name:
Gamma-aminobutyric acid receptor subunit gamma-2
Synonyms:
GABA(A) receptor subunit gamma-2 GBRG2_HUMAN
Type:
PROTEIN
Mol. Mass.:
54172.74
Organism:
Homo sapiens (Human)
Description:
EBI_217
Residue:
467
  
Component 2
Name:
Gamma-aminobutyric acid receptor subunit beta-3
Synonyms:
GABA A receptor alpha-4/beta-3/gamma-2 GABA-A receptor GBRB3_HUMAN | agonist GABA site
Type:
PROTEIN
Mol. Mass.:
54130.51
Organism:
Homo sapiens (Human)
Description:
ChEMBL_448071
Residue:
473
  
Component 3
Name:
Gamma-aminobutyric acid receptor subunit alpha-3
Synonyms:
GABA A Alpha3Beta3Gamma2 GABA C GABA-A receptor GBRA3_HUMAN agonist GABA site
Type:
Enzyme Catalytic Domain
Mol. Mass.:
55175.47
Organism:
Homo sapiens (Human)
Description:
GABA A Alpha3Beta1Gamma2 0 HUMAN::P34903
Residue:
492
  
Inhibitor
Name:
BDBM50156083
Synonyms:
3-tert-Butyl-7-(5-methyl-isoxazol-3-yl)-2-(2-methyl-2H-[1,2,4]triazol-3-ylmethoxy)-pyrazolo[1,5-d][1,2,4]triazine CHEMBL363211
Type:
Small organic molecule
Emp. Form.:
C17H20N8O2
Mol. Mass.:
368.3931
SMILES:
Cc1cc(no1)-c1nncc2c(c(OCc3ncnn3C)nn12)C(C)(C)C
: