Target
GABA-A receptor; alpha-2/beta-3/gamma-2
Ligand
BDBM50065229
Substrate
Meas. Tech.
ChEMBL_303794 (CHEMBL829843)
Ki
13±n/a nM
Citation
 Chambers, MSAtack, JRCarling, RWCollinson, NCook, SMDawson, GRFerris, PHobbs, SCO'connor, DMarshall, GRycroft, WMacleod, AM An orally bioavailable, functionally selective inverse agonist at the benzodiazepine site of GABAA alpha5 receptors with cognition enhancing properties. J Med Chem 47:5829-32 (2004)  
Target
Name:
GABA-A receptor; alpha-2/beta-3/gamma-2
Synonyms:
GABA receptor alpha-2/beta-3/gamma-2 subunit | Gamma-aminobutyric acid receptor subunit alpha-2/beta-3/gamma-2
Type:
Mol. Mass.:
Description:
ASSAY_ID of ChEMBL is 2148174
Components:
This complex has 3 components.
Component 1
Name:
Gamma-aminobutyric acid receptor subunit gamma-2
Synonyms:
GABA(A) receptor subunit gamma-2 GBRG2_HUMAN
Type:
PROTEIN
Mol. Mass.:
54172.74
Organism:
Homo sapiens (Human)
Description:
EBI_217
Residue:
467
  
Component 2
Name:
Gamma-aminobutyric acid receptor subunit beta-3
Synonyms:
GABA A receptor alpha-4/beta-3/gamma-2 GABA-A receptor GBRB3_HUMAN | agonist GABA site
Type:
PROTEIN
Mol. Mass.:
54130.51
Organism:
Homo sapiens (Human)
Description:
ChEMBL_448071
Residue:
473
  
Component 3
Name:
Gamma-aminobutyric acid receptor subunit alpha-2
Synonyms:
GABA receptor alpha-2 subunit GBRA2_HUMAN | Gamma-aminobutyric acid receptor subunit alpha-2 (GABRA2)
Type:
Protein
Mol. Mass.:
51338.78
Organism:
Homo sapiens (Human)
Description:
P47869
Residue:
451
  
Inhibitor
Name:
BDBM50065229
Synonyms:
4-Ethyl-6,7-dimethoxy-9H-beta-carboline-3-carboxylic acid methyl ester 4-Ethyl-6,7-dimethoxy-9H-carbazole-3-carboxylic acid methyl ester | CHEMBL17468
Type:
Small organic molecule
Emp. Form.:
C17H18N2O4
Mol. Mass.:
314.3358
SMILES:
CCc1c([nH]cc2nc3cc(OC)c(OC)cc3c12)C(=O)OC
: